2,5-dimethyl-3-[(methylthio)propyl]pyrazine

Normal alkane RI, non-polar column, temperature ramp

View large format table.

Column type Active phase I Reference Comment
CapillaryDB-11601.Yu and Ho, 199560. m/0.25 mm/1. μm, He, 40. C @ 5. min, 2. K/min, 260. C @ 60. min

References

Yu and Ho, 1995
Yu, T.-H.; Ho, C.-T., Volatile compounds generated from thermal reaction of methionine and methionine sulfoxide with or without glucose, J. Agric. Food Chem., 1995, 43, 6, 1641-1646, https://doi.org/10.1021/jf00054a043 . [all data]