cis-ligustilide

Van Den Dool and Kratz RI, non-polar column, temperature ramp

Data compiled by: NIST Mass Spectrometry Data Center, William E. Wallace, director

Column type Capillary
Active phase HP-1
Column length (m) 50.
Carrier gas He
Substrate
Column diameter (mm) 0.32
Phase thickness (μm) 1.05
Tstart (C) 40.
Tend (C) 230.
Heat rate (K/min) 2.
Initial hold (min)
Final hold (min) 40.
I 1718.
ReferenceTang, Zhang, et al., 1990
Comment MSDC-RI

Van Den Dool and Kratz RI, polar column, temperature ramp

Data compiled by: NIST Mass Spectrometry Data Center, William E. Wallace, director

Column type Capillary
Active phase DB-Wax
Column length (m) 60.
Carrier gas N2
Substrate
Column diameter (mm) 0.25
Phase thickness (μm) 0.25
Tstart (C) 70.
Tend (C) 230.
Heat rate (K/min) 2.
Initial hold (min)
Final hold (min) 20.
I 2619.
ReferenceChoi, Kim. M.-S.L., et al., 2002
Comment MSDC-RI

Normal alkane RI, non-polar column, temperature ramp

Data compiled by: NIST Mass Spectrometry Data Center, William E. Wallace, director

Column type CapillaryCapillaryCapillaryCapillary
Active phase HP-5MSHP-5HP-5MSHP-5MS
Column length (m) 30.30.30.30.
Carrier gas HeN2HeHe
Substrate
Column diameter (mm) 0.250.250.250.25
Phase thickness (μm) 0.250.250.250.25
Tstart (C) 50.50.50.50.
Tend (C) 280.280.280.280.
Heat rate (K/min) 5.9.5.5.
Initial hold (min) 4.3.4.4.
Final hold (min) 10.3.10.10.
I 1758.1680.1739.1740.
ReferenceCho, Abd El-Aty, et al., 2007Abdelwahed, Hayder, et al., 2006Kim, Abd El-Aty, et al., 2006Kim, El-Aty, et al., 2006
Comment MSDC-RI MSDC-RI MSDC-RI MSDC-RI

References

Tang, Zhang, et al., 1990
Tang, J.; Zhang, Y.; Hartman, T.G.; Rosen, R.T.; Ho, C.-T., Free and glycosidically bound volatile compounds in fresh celery (Apium graveolens L.), J. Agric. Food Chem., 1990, 38, 10, 1937-1940, https://doi.org/10.1021/jf00100a013 . [all data]