2-methyl-3-furyl 2-oxo-3-pentyl disulfide

Van Den Dool and Kratz RI, non-polar column, custom temperature program

Data compiled by: NIST Mass Spectrometry Data Center, William E. Wallace, director

Column type CapillaryCapillaryCapillary
Active phase SE-54SE-54DB-5
Column length (m) 30.30.50.
Carrier gas  HeHe
Substrate
Column diameter (mm) 0.320.320.32
Phase thickness (μm) 0.250.25
Program 40C(2min) => 40C/min => 50C(5min) => 6C/min => 230C(15min)40C (2min) => 40C/min => 50C (5min) => 6C/min => 230C (15min)0C => 60C/min => 60C (5min) => 4C/min => 250C
I 1561.1561.1580.
ReferenceHofmann, Schieberle, et al., 1996Hofmann and Schieberle, 1995Mottram and Whitfield, 1995
Comment MSDC-RI MSDC-RI MSDC-RI

Van Den Dool and Kratz RI, polar column, custom temperature program

Data compiled by: NIST Mass Spectrometry Data Center, William E. Wallace, director

Column type CapillaryCapillary
Active phase FFAPFFAP
Column length (m) 30.30.
Carrier gas  He
Substrate
Column diameter (mm) 0.320.32
Phase thickness (μm) 0.250.25
Program 40C(2min) => 40C/min => 60C(5min) => 6C/min => 230C(15min)40C (2min) => 40C/min => 60C (5min) => 6C/min => 230C (15min)
I 2145.2145.
ReferenceHofmann, Schieberle, et al., 1996Hofmann and Schieberle, 1995
Comment MSDC-RI MSDC-RI

Van Den Dool and Kratz RI, polar column, temperature ramp

Data compiled by: NIST Mass Spectrometry Data Center, William E. Wallace, director

Column type Capillary
Active phase DB-Wax
Column length (m) 60.
Carrier gas He
Substrate
Column diameter (mm) 0.25
Phase thickness (μm) 0.25
Tstart (C) 35.
Tend (C) 210.
Heat rate (K/min) 2.
Initial hold (min) 5.
Final hold (min) 30.
I 2205.
ReferenceRuther and Baltes, 1994
Comment MSDC-RI

References

Hofmann, Schieberle, et al., 1996
Hofmann, T.; Schieberle, P.; Grosch, W., Model studies on the oxidative stability of odor-active thiols occurring in food flavors, J. Agric. Food Chem., 1996, 44, 1, 251-255, https://doi.org/10.1021/jf9500703 . [all data]

Hofmann and Schieberle, 1995
Hofmann, T.; Schieberle, P., Evaluation of the key odorants in a thermally treated solution of ribose and cysteine by aroma extract dilution techniques, J. Agric. Food Chem., 1995, 43, 8, 2187-2194, https://doi.org/10.1021/jf00056a042 . [all data]

Mottram and Whitfield, 1995
Mottram, D.S.; Whitfield, F.B., Volatile compounds from the reaction of cysteine, ribose, and phospholipid in low-moisture systems, J. Agric. Food Chem., 1995, 43, 4, 984-988, https://doi.org/10.1021/jf00052a027 . [all data]