(1,2,2-trimethyl-3-cyclopenten-1-yl)acetaldehyde

Normal alkane RI, polar column, temperature ramp

View large format table.

Column type Active phase I Reference Comment
CapillaryDB-Wax1472.Iwanami, Tateba, et al., 199730. m/0.25 mm/0.25 μm, N2, 2. K/min; Tstart: 80. C; Tend: 200. C

References

Iwanami, Tateba, et al., 1997
Iwanami, Y.; Tateba, H.; Kodama, N.; Kishino, K., Changes of lemon flavor components in an aqueous solution during UV irradiation, J. Agric. Food Chem., 1997, 45, 2, 463-466, https://doi.org/10.1021/jf960100h . [all data]