2-(2,5-Dimethoxy-4-ethylphenyl)ethylamine, N-acetyl-

Kovats' RI, non-polar column, temperature ramp

View large format table.

Column type Active phase I Reference Comment
CapillaryHP-12000.Theobald and Maurer, 200612. m/0.2 mm/0.33 μm, He, 100. C @ 3. min, 30. K/min, 310. C @ 8. min

References

Theobald and Maurer, 2006
Theobald, D.S.; Maurer, H.H., Studies on the metabolism and toxicological detection of the designer drug 4-ethyl-2,5-dimethoxy-β-phenethylamine (2C-E) in rat urine using gas chromatographic-mass spectrometric techniques, J. Chromatogr. B, 2006, 842, 2, 76-90, https://doi.org/10.1016/j.jchromb.2006.03.001 . [all data]