cis/trans-2-methyl-3-tetrahydro-furanthiol

Normal alkane RI, polar column, custom temperature program

Data compiled by: NIST Mass Spectrometry Data Center, William E. Wallace, director

Column type Capillary
Active phase FFAP
Column length (m)
Carrier gas
Substrate
Column diameter (mm)
Phase thickness (μm)
Program not specified
I 1315.
ReferenceBlank, Stampfli, et al., 1994
Comment MSDC-RI

References

Blank, Stampfli, et al., 1994
Blank, I.; Stampfli, A.; Eisenreich, W., Analysis of food flavourings by gas chromatography - olfactometry in Trends of Flavour Research, Maarse, H.; van der Heij, D.G., ed(s)., 1994, 271-276. [all data]