Sebacic acid, ethyl methyl ester

Van Den Dool and Kratz RI, non-polar column, temperature ramp

Data compiled by: NIST Mass Spectrometry Data Center, William E. Wallace, director

Column type CapillaryCapillary
Active phase 5 % Phenyl methyl siloxaneOV-1
Column length (m) 30.25.
Carrier gas  He
Substrate
Column diameter (mm) 0.250.32
Phase thickness (μm) 0.25
Tstart (C) 60.40.
Tend (C) 270.280.
Heat rate (K/min) 15.8.
Initial hold (min)
Final hold (min) 15.10.
I 1736.1692.
ReferenceZaikin, 2009Tan, Holland, et al., 1988
Comment MSDC-RI MSDC-RI

References

Zaikin, 2009
Zaikin, V.G., Personal Communication: Retention indices measured during the period 2008 to 2009, 2009. [all data]

Tan, Holland, et al., 1988
Tan, S.-T.; Holland, P.T.; Wilkins, A.L.; Molan, P.C., Extractives from New Zealand honeys. 1. White clovers, manuka, and kanuka unifloral honeys, J. Agric. Food Chem., 1988, 36, 3, 453-460, https://doi.org/10.1021/jf00081a012 . [all data]