4-Chlorobenzoic acid, 2,2,2-trichloroethyl ester

Kovats' RI, non-polar column, isothermal

View large format table.

Column type Active phase Temperature (C) I Reference Comment
CapillarySE-30140.1683.Korhonen and Lind, 1985
CapillarySE-30160.1696.Korhonen and Lind, 1985
CapillarySE-30180.1711.Korhonen and Lind, 1985

Van Den Dool and Kratz RI, non-polar column, temperature ramp

View large format table.

Column type Active phase I Reference Comment
CapillarySE-301717.Korhonen and Lind, 198510. K/min; Tstart: 100. C; Tend: 280. C
CapillarySE-301692.Korhonen and Lind, 19852. K/min; Tstart: 100. C; Tend: 280. C
CapillarySE-301702.Korhonen and Lind, 19856. K/min; Tstart: 100. C; Tend: 280. C

References

Korhonen and Lind, 1985
Korhonen, I.O.O.; Lind, M.A., Gas-liquid chromatographic analyses. XLI. Ethyl and ω-chloroethyl esters of benzoic and monochlorobenzoic acids on SE-30 and OV-351 capillary columns, J. Chromatogr., 1985, 325, 433-443, https://doi.org/10.1016/S0021-9673(00)96054-0 . [all data]