1,4-Benzenedithiol, S,S'-bis(tert-butyldimethylsilyl)-
- Formula: C18H34S2Si2
- Molecular weight: 370.764
- IUPAC Standard InChIKey: ZQKJHRAASGSRPE-UHFFFAOYSA-N
- Chemical structure:

Van Den Dool and Kratz RI, non-polar column, custom temperature program

Column type | Active phase | I | Reference | Comment |
---|---|---|---|---|
Capillary | VF-5MS | 2324.9 | Tret'yakov, 2008 | 30. m/0.25 mm/0.25 μm, He; Program: Multi-step temperature program; T(initial)=60C; T(final)=270C |

References

Tret'yakov, 2008
Tret'yakov, K.V.,
Retention Data. NIST Mass Spectrometry Data Center., NIST Mass Spectrometry Data Center, 2008. [all data]