Isovanillin, TMS derivative

Van Den Dool and Kratz RI, non-polar column, temperature ramp

View large format table.

Column type Active phase I Reference Comment
PackedSE-301521.Lhuguenot, Maume, et al., 1971N2, Gas Chrom P (120-140 mesh), 1. K/min; Column length: 3. m; Tstart: 100. C; Tend: 180. C

Van Den Dool and Kratz RI, non-polar column, custom temperature program

View large format table.

Column type Active phase I Reference Comment
CapillaryVF-5MS1563.1Tret'yakov, 200830. m/0.25 mm/0.25 μm, He; Program: Multi-step temperature program; T(initial)=60C; T(final)=270C

References

Lhuguenot, Maume, et al., 1971
Lhuguenot, J.C.; Maume, B.F.; Baron, C., Gas Chromatographic and Mass Spectrometric Study of Vanillin Related Compounds, Chromatographia, 1971, 4, 5, 204-208, https://doi.org/10.1007/BF02281053 . [all data]

Tret'yakov, 2008
Tret'yakov, K.V., Retention Data. NIST Mass Spectrometry Data Center., NIST Mass Spectrometry Data Center, 2008. [all data]