Estriol, tris(trifluoroacetate)

Van Den Dool and Kratz RI, non-polar column, custom temperature program

View large format table.

Column type Active phase I Reference Comment
CapillaryVF-5MS2343.2Tret'yakov, 200830. m/0.25 mm/0.25 μm, He; Program: Multi-step temperature program; T(initial)=60C; T(final)=270C

Normal alkane RI, non-polar column, isothermal

View large format table.

Column type Active phase Temperature (C) I Reference Comment
PackedOV-1200.2352.Dehennin and Scholler, 1969N2, Gas-Chrom Q; Column length: 1.50 m
PackedOV-1200.2362.Dehennin and Scholler, 1969N2, Gas-Chrom Q; Column length: 1.50 m

References

Tret'yakov, 2008
Tret'yakov, K.V., Retention Data. NIST Mass Spectrometry Data Center., NIST Mass Spectrometry Data Center, 2008. [all data]

Dehennin and Scholler, 1969
Dehennin, L.; Scholler, R., Correlation entre la structure moleculaire de quelques steroides en C18 et leurs grandeurs de retention en chromatographie en phase gazeuse, J. Steroid Biochem., 1969, 1, 1, 57-76, https://doi.org/10.1016/0022-4731(69)90009-0 . [all data]