2-[2-(2-Ethoxyethoxy)ethoxy]ethyl 2,2,3,3,4,4,4-heptafluorobutanoate

Van Den Dool and Kratz RI, non-polar column, custom temperature program

View large format table.

Column type Active phase I Reference Comment
CapillaryVF-5MS1327.5Zheng and White, 200830. m/0.25 mm/0.25 μm, He; Program: not specified

References

Zheng and White, 2008
Zheng, Y.; White, E., Retention Data. NIST Mass Spectrometry Data Center., NIST Mass Spectrometry Data Center, 2008. [all data]