1-Eicosanol, TMS derivative

Normal alkane RI, non-polar column, temperature ramp

Data compiled by: NIST Mass Spectrometry Data Center, William E. Wallace, director

Column type Capillary
Active phase OV-101
Column length (m) 50.
Carrier gas H2
Substrate
Column diameter (mm) 0.30
Phase thickness (μm)
Tstart (C) 150.
Tend (C) 300.
Heat rate (K/min) 2.
Initial hold (min)
Final hold (min)
I 2360.
ReferencePfeifer and Spiteller, 1981
Comment MSDC-RI

References

Pfeifer and Spiteller, 1981
Pfeifer, P.; Spiteller, G., Steroid Profiles of Healthy Individuals, J. Chromatogr., 1981, 223, 1, 21-32, https://doi.org/10.1016/S0378-4347(00)80064-X . [all data]