Silane, trimethyl(nonadecyloxy)-

Van Den Dool and Kratz RI, non-polar column, temperature ramp

View large format table.

Column type Active phase I Reference Comment
CapillaryOV-52276.García, Sáenz, et al., 199725. m/0.25 mm/0.23 μm, He, 230. C @ 6. min, 4. K/min; Tend: 300. C
CapillaryOV-12259.Harvey, 198950. m/0.30 mm/0.52 μm, He, 2. K/min; Tstart: 130. C; Tend: 280. C

Van Den Dool and Kratz RI, non-polar column, custom temperature program

View large format table.

Column type Active phase I Reference Comment
CapillaryVF-5MS2246.1Tret'yakov, 200830. m/0.25 mm/0.25 μm, He; Program: Multi-step temperature program; T(initial)=60C; T(final)=270C
CapillaryVF-5MS2248.5Zheng and White, 200830. m/0.25 mm/0.25 μm, He; Program: not specified

References

García, Sáenz, et al., 1997
García, M.D.; Sáenz, M.T.; Ahumada, M.D.; Cert, A., Isolation of three triterpenes and several aliphatic alcohols from Crataegus monogyna Jacq., J. Chromatogr. A, 1997, 767, 1-2, 340-342, https://doi.org/10.1016/S0021-9673(96)01091-6 . [all data]

Harvey, 1989
Harvey, D.J., Identification of long-chain fatty acids and alcohols from human cerumen by the use of picolinyl and nicotinate esters, Biomed. Environ. Mass Spectrom., 1989, 18, 9, 719-723, https://doi.org/10.1002/bms.1200180912 . [all data]

Tret'yakov, 2008
Tret'yakov, K.V., Retention Data. NIST Mass Spectrometry Data Center., NIST Mass Spectrometry Data Center, 2008. [all data]

Zheng and White, 2008
Zheng, Y.; White, E., Retention Data. NIST Mass Spectrometry Data Center., NIST Mass Spectrometry Data Center, 2008. [all data]