Fumaric acid, 2,2,3,3,4,4,5,5-octafluoropentyl undecyl ester
- Formula: C20H28F8O4
- Molecular weight: 484.4211
- IUPAC Standard InChIKey: YUSCWXMPPJBOBL-VAWYXSNFSA-N
- Chemical structure:

Van Den Dool and Kratz RI, non-polar column, custom temperature program

Column type | Active phase | I | Reference | Comment |
---|---|---|---|---|
Capillary | 5 % Phenyl methyl siloxane | 2135. | Zaikin, 2008 | Column length: 30. m; Column diameter: 0.19 mm; Program: 20C => 5C/min => 120C => 10C/min => 280C |

References

Zaikin, 2008
Zaikin, V.G.,
Personal Communication: Retention indices measured during the period 2007 to 2008, 2008. [all data]