D-Alanine, N-(2,4,5-trifluoro-3-methoxybenzoyl)-, ethyl ester
- Formula: C13H14F3NO4
- Molecular weight: 305.2498
- IUPAC Standard InChIKey: AVEFJQGYAPMVDP-UHFFFAOYSA-N
- Chemical structure:

Van Den Dool and Kratz RI, non-polar column, custom temperature program

Column type | Active phase | I | Reference | Comment |
---|---|---|---|---|
Capillary | 5 % Phenyl methyl siloxane | 1890. | Zaikin, 2008 | Column length: 30. m; Column diameter: 0.19 mm; Program: 20C => 5C/min => 120C => 10C/min => 280C |

References

Zaikin, 2008
Zaikin, V.G.,
Personal Communication: Retention indices measured during the period 2007 to 2008, 2008. [all data]