D-Alanine, N-(5-fluoro-2-trifluoromethylbenzoyl)-, octyl ester
- Formula: C19H25F4NO3
- Molecular weight: 391.4003
- IUPAC Standard InChIKey: JQELIGNFXYFSAP-UHFFFAOYSA-N
- Chemical structure:

Van Den Dool and Kratz RI, non-polar column, custom temperature program

Column type | Active phase | I | Reference | Comment |
---|---|---|---|---|
Capillary | 5 % Phenyl methyl siloxane | 2241. | Zaikin, 2008 | Column length: 30. m; Column diameter: 0.19 mm; Program: 20C => 5C/min => 120C => 10C/min => 280C |

References

Zaikin, 2008
Zaikin, V.G.,
Personal Communication: Retention indices measured during the period 2007 to 2008, 2008. [all data]