Silane, dimethyl(dimethyl(undec-2-enyloxy)silyloxy)pentyloxy-
- Formula: C20H44O3Si2
- Molecular weight: 388.7326
- IUPAC Standard InChIKey: AACKBNQHVFHSOT-FBMGVBCBSA-N
- Chemical structure:

Van Den Dool and Kratz RI, non-polar column, custom temperature program

Column type | Active phase | I | Reference | Comment |
---|---|---|---|---|
Capillary | 5 % Phenyl methyl siloxane | 2006. | Zaikin, 2008 | Column length: 30. m; Column diameter: 0.19 mm; Program: 20C => 5C/min => 120C => 10C/min => 280C |

References

Zaikin, 2008
Zaikin, V.G.,
Personal Communication: Retention indices measured during the period 2007 to 2008, 2008. [all data]