1,7-Di(3-methylphenyl)-2,2,4,4,6,6-hexamethyl-1,3,5,7-tetraoxa-2,4,6-trisilaheptane
- Formula: C20H32O4Si3
- Molecular weight: 420.7222
- IUPAC Standard InChIKey: NLKIHBWKFSYQMK-UHFFFAOYSA-N
- Chemical structure:

Van Den Dool and Kratz RI, non-polar column, custom temperature program

Column type | Active phase | I | Reference | Comment |
---|---|---|---|---|
Capillary | 5 % Phenyl methyl siloxane | 2091. | Zaikin, 2008 | Column length: 30. m; Column diameter: 0.19 mm; Program: 20C => 5C/min => 120C => 10C/min => 280C |

References

Zaikin, 2008
Zaikin, V.G.,
Personal Communication: Retention indices measured during the period 2007 to 2008, 2008. [all data]