Silane, dimethyl(dimethyl(2-chlorophenoxy)silyloxy)octyloxy-
- Formula: C18H33ClO3Si2
- Molecular weight: 389.077
- IUPAC Standard InChIKey: LCYDFVLEXSXGCI-UHFFFAOYSA-N
- Chemical structure:

Van Den Dool and Kratz RI, non-polar column, custom temperature program

Column type | Active phase | I | Reference | Comment |
---|---|---|---|---|
Capillary | 5 % Phenyl methyl siloxane | 2046. | Zaikin, 2008 | Column length: 30. m; Column diameter: 0.19 mm; Program: 20C => 5C/min => 120C => 10C/min => 280C |

References

Zaikin, 2008
Zaikin, V.G.,
Personal Communication: Retention indices measured during the period 2007 to 2008, 2008. [all data]