Silane, dimethylhexyloxyethoxy-

Kovats' RI, non-polar column, isothermal

View large format table.

Column type Active phase Temperature (C) I Reference Comment
PackedApiezon M160.1042.Peetre, Ellren, et al., 1985Chromosorb G; Column length: 3. m

Van Den Dool and Kratz RI, non-polar column, custom temperature program

View large format table.

Column type Active phase I Reference Comment
Capillary5 % Phenyl methyl siloxane1118.Zaikin, 2008Column length: 30. m; Column diameter: 0.19 mm; Program: 20C => 5C/min => 120C => 10C/min => 280C

References

Peetre, Ellren, et al., 1985
Peetre, I.-B.; Ellren, O.; Smith, B.E.F., Gas chromatographic investigation of organometallic compounds and their carbon analogues. VI. Determination, calculation and correlation of Kováts retention indices for alkylalkoxysilanes, J. Chromatogr., 1985, 318, 41-55, https://doi.org/10.1016/S0021-9673(01)90662-4 . [all data]

Zaikin, 2008
Zaikin, V.G., Personal Communication: Retention indices measured during the period 2007 to 2008, 2008. [all data]