Isophthalic acid, 3-fluorophenyl pentadecyl ester

Van Den Dool and Kratz RI, non-polar column, custom temperature program

Data compiled by: NIST Mass Spectrometry Data Center, William E. Wallace, director

Column type Capillary
Active phase 5 % Phenyl methyl siloxane
Column length (m) 20.
Carrier gas
Substrate
Column diameter (mm) 0.19
Phase thickness (μm)
Program 20C => 5C/min => 120C => 10C/min => 280C
I 3620.
ReferenceZaikin, 2007
Comment MSDC-RI

References

Zaikin, 2007
Zaikin, V.G., Personal Communication: Retention indices measured during the period 2006 to 2007 (II), 2007. [all data]