sec-Butyl t-butyl sulfide

Kovats' RI, non-polar column, isothermal

Data compiled by: NIST Mass Spectrometry Data Center, William E. Wallace, director

Column type PackedPacked
Active phase Apiezon MApiezon L
Column length (m) 2.1
Carrier gas He or N2
Substrate Chromosorb W, AW-DMCS
Column diameter (mm)
Phase thickness (μm)
Temperature (C) 130.130.
I 934.952.
ReferenceGarbuzov, Misharina, et al., 1985Martinu and Janák, 1970
Comment MSDC-RI MSDC-RI

Normal alkane RI, non-polar column, custom temperature program

Data compiled by: NIST Mass Spectrometry Data Center, William E. Wallace, director

Column type CapillaryPacked
Active phase Apiezon MApiezon M
Column length (m)
Carrier gas
Substrate
Column diameter (mm)
Phase thickness (μm)
Program not specifiednot specified
I 934.934.
ReferenceLiu, Cao, et al., 2005Yu and Yang, 2005
Comment MSDC-RI MSDC-RI

References

Garbuzov, Misharina, et al., 1985
Garbuzov, V.G.; Misharina, T.A.; Aerov, A.F.; Golovnya, R.V., Gas chromatographic retention indices for sulphur(II)-containing organic substances, J. Anal. Chem. USSR (Engl. Transl.), 1985, 40, 4, 576-586. [all data]

Martinu and Janák, 1970
Martinu, V.; Janák, J., Gas-liquid chromatographic retention data of some aliphatic and alicyclic sulphides, J. Chromatogr., 1970, 52, 69-75, https://doi.org/10.1016/S0021-9673(01)96545-8 . [all data]