N-Decyl ethyl sulfide

Kovats' RI, non-polar column, isothermal

View large format table.

Column type Active phase Temperature (C) I Reference Comment
PackedApiezon M130.1493.Garbuzov, Misharina, et al., 1985He or N2, Chromosorb W, AW-DMCS; Column length: 2.1 m
PackedApiezon M130.1493.Golovnya and Misharina, 1980N2, Chromosorb W AW DMCS; Column length: 2.1 m
PackedApiezon M130.1493.Golovnya and Misharina, 1980, 2N2, Chromosorb W AW DMCS; Column length: 2.1 m
PackedApiezon M130.1493.Golovnya, Garbuzov, et al., 1976N2, Chromosorb W; Column length: 2.1 m

Kovats' RI, polar column, isothermal

View large format table.

Column type Active phase Temperature (C) I Reference Comment
PackedPolyethylene Glycol130.1710.Golovnya, Garbuzov, et al., 1976N2, Chromosorb W; Column length: 2.1 m

References

Garbuzov, Misharina, et al., 1985
Garbuzov, V.G.; Misharina, T.A.; Aerov, A.F.; Golovnya, R.V., Gas chromatographic retention indices for sulphur(II)-containing organic substances, J. Anal. Chem. USSR (Engl. Transl.), 1985, 40, 4, 576-586. [all data]

Golovnya and Misharina, 1980
Golovnya, R.V.; Misharina, T.A., Determination of the energy of intermolecular interactions in gas chromatography from retention indices, J. Chromatogr., 1980, 190, 1, 1-12, https://doi.org/10.1016/S0021-9673(00)85506-5 . [all data]

Golovnya and Misharina, 1980, 2
Golovnya, R.V.; Misharina, T.A., Gas-chromatographic determination of energy contributions of isoaliphatic and unsaturated groups in sulfides and disulfides and of sulfur atoms in metameric thiatridecanes from retention indices, Izv. Akad. Nauk SSSR Ser. Khim., 1980, 12, 1937-1942. [all data]

Golovnya, Garbuzov, et al., 1976
Golovnya, R.V.; Garbuzov, V.G.; Misharina, T.A., Gas chromatographic characteristics of sulfur compounds. 2. Normal sulfides, Izv. Akad. Nauk Kaz. SSR Ser. Khim., 1976, 10, 2266-2270. [all data]