5-Bromo-2,4-bis[(trimethylsilyl)oxy]pyrimidine

Kovats' RI, non-polar column, isothermal

View large format table.

Column type Active phase Temperature (C) I Reference Comment
PackedOV-101160.1529.1Miller, Pacáková, et al., 1976Ar, AW-DMCS Chromosorb W HP; Column length: 2. m
PackedSE-30150.1532.Pacakova, Miller, et al., 1971
PackedOV-101150.1533.Pacakova, Miller, et al., 1971

Van Den Dool and Kratz RI, non-polar column, custom temperature program

View large format table.

Column type Active phase I Reference Comment
CapillaryVF-5MS1531.2Tret'yakov, 200730. m/0.25 mm/0.25 μm, He; Program: Multi-step temperature program; T(initial)=60C; T(final)=270C

References

Miller, Pacáková, et al., 1976
Miller, V.; Pacáková, V.; Smolková, E., Gas-liquid chromatographic analysis of trimethylsilyl derivatives of pyrimidine and purine bases and nucleosides, J. Chromatogr., 1976, 119, 355-367, https://doi.org/10.1016/S0021-9673(00)86799-0 . [all data]

Pacakova, Miller, et al., 1971
Pacakova, V.; Miller, V.; Cernohorsky, I.J., Gas-Liquid Chromatography of Some Pyrimidine Derivatives, Anal. Biochemistry, 1971, 42, 2, 549-554, https://doi.org/10.1016/0003-2697(71)90071-6 . [all data]

Tret'yakov, 2007
Tret'yakov, K.V., Retention Data. NIST Mass Spectrometry Data Center., NIST Mass Spectrometry Data Center, 2007. [all data]