Butyric Acid, TBDMS derivative

Normal alkane RI, non-polar column, temperature ramp

Data compiled by: NIST Mass Spectrometry Data Center, William E. Wallace, director

Column type CapillaryCapillaryCapillary
Active phase DB-5DB-1DB-5
Column length (m) 30.30.15.
Carrier gas HeliumN2He
Substrate
Column diameter (mm) 0.250.320.32
Phase thickness (μm) 0.250.250.25
Tstart (C) 60.60.60.
Tend (C) 290.280.200.
Heat rate (K/min) 4.4.10.
Initial hold (min) 2.2.2.
Final hold (min)
I 1097.1074.1103.
ReferencePaik, Lee, et al., 2005Kim, Hahn, et al., 1989Kim, Zlatkis, et al., 1987
Comment MSDC-RI MSDC-RI MSDC-RI

References

Paik, Lee, et al., 2005
Paik, M.-J.; Lee, H.-J.; Kim, K.-R., Simultaneous retention index analysis of urinary amino acids and carboxylic acids for graphic recognition of abnormal state, J. Chromatogr. B, 2005, 821, 1, 94-104, https://doi.org/10.1016/j.jchromb.2005.04.011 . [all data]

Kim, Hahn, et al., 1989
Kim, K.R.; Hahn, M.K.; Zlatkis, A.; Horning, E.C.; Middleditch, B.S., Simultaneous gas chromatography of volatile and nonvolatile carboxylic acids as tert.-butyldimethylsilyl derivatives, J. Chromatogr., 1989, 468, 289-301, https://doi.org/10.1016/S0021-9673(00)96323-4 . [all data]

Kim, Zlatkis, et al., 1987
Kim, K.; Zlatkis, A.; Horning, E.C.; Middleditch, B.S., Gas chromatography of volatile fatty acids as tert-butyldimethylsilyl esters, J. Hi. Res. Chromatogr. Chromatogr. Comm., 1987, 10, 9, 522-523, https://doi.org/10.1002/jhrc.1240100910 . [all data]