3-Methyl-2-ketobutyric acid pfbo-tms

Van Den Dool and Kratz RI, non-polar column, temperature ramp

View large format table.

Column type Active phase I Reference Comment
CapillaryDB-11537.Hoffmann, Aramaki, et al., 198930. m/0.53 mm/1. μm, He, 4. K/min; Tstart: 70. C; Tend: 290. C
CapillaryDB-11556.Hoffmann, Aramaki, et al., 198930. m/0.53 mm/1. μm, He, 4. K/min; Tstart: 70. C; Tend: 290. C

References

Hoffmann, Aramaki, et al., 1989
Hoffmann, G.; Aramaki, S.; Blum-Hoffmann, E.; Nyhan, W.L.; Sweetman, L., Quantitative analysis for organic acids in biological samples: batch isolation followed by gas chromatographic-mass spectrometric analysis, Clin. Chem., 1989, 35, 4, 587-595. [all data]