2-Mercapto-3,4-dimethyl-2,3-dihydrothiophene

Van Den Dool and Kratz RI, non-polar column, temperature ramp

Data compiled by: NIST Mass Spectrometry Data Center, William E. Wallace, director

Column type CapillaryCapillary
Active phase HP-1HP-1
Column length (m) 50.50.
Carrier gas HeHe
Substrate
Column diameter (mm) 0.320.32
Phase thickness (μm) 1.051.05
Tstart (C) 40.40.
Tend (C) 260.260.
Heat rate (K/min) 2.2.
Initial hold (min)
Final hold (min)
I 1149.1155.
ReferenceKuo and Ho, 1992Kuo and Ho, 1992, 2
Comment MSDC-RI MSDC-RI

References

Kuo and Ho, 1992
Kuo, M.-C.; Ho, C.-T., Volatile constituents of the distilled oils of Welsh onions (Allium fistulosum L. variety Maichuon) and scallions (Allium fistulosum L. variety Caespitosum), J. Agric. Food Chem., 1992, 40, 1, 111-117, https://doi.org/10.1021/jf00013a021 . [all data]

Kuo and Ho, 1992, 2
Kuo, M.-C.; Ho, C.-T., Volatile constituents of the solvent extracts of Welsh onions (Allium fistulosum L. variety Maichuon) and scallions (A. fistulosum L. variety caepitosum), J. Agric. Food Chem., 1992, 40, 10, 1906-1910, https://doi.org/10.1021/jf00022a036 . [all data]