6-Ethyl-4,5,7,8-tetrathia-2-nonene

Van Den Dool and Kratz RI, non-polar column, temperature ramp

View large format table.

Column type Active phase I Reference Comment
CapillaryHP-11620.Kuo and Ho, 199250. m/0.32 mm/1.05 μm, He, 2. K/min; Tstart: 40. C; Tend: 260. C
CapillaryHP-11620.Kuo, Chien, et al., 199050. m/0.32 mm/1.05 μm, He, 2. K/min; Tstart: 40. C; Tend: 260. C

References

Kuo and Ho, 1992
Kuo, M.-C.; Ho, C.-T., Volatile constituents of the distilled oils of Welsh onions (Allium fistulosum L. variety Maichuon) and scallions (Allium fistulosum L. variety Caespitosum), J. Agric. Food Chem., 1992, 40, 1, 111-117, https://doi.org/10.1021/jf00013a021 . [all data]

Kuo, Chien, et al., 1990
Kuo, M.-C.; Chien, M.; Ho, C.-T., Novel Polysulfides Identified in the Volatile Components from Welsh Onions (Allium fistulosum L. var. maichuon) and Scallions (Allium fistulosum L. var. caespitosum), J. Agric. Food Chem., 1990, 38, 6, 1378-1381, https://doi.org/10.1021/jf00096a017 . [all data]