Phthalic acid, hexyl heptyl ester

Kovats' RI, non-polar column, isothermal

View large format table.

Column type Active phase Temperature (C) I Reference Comment
CapillaryOV-101230.2404.Friocourt, Berthou, et al., 197950. m/0.3 mm/0.35 μm, H2

References

Friocourt, Berthou, et al., 1979
Friocourt, M.P.; Berthou, F.; Picart, D.; Dreano, Y.; Floch, H.H., Glass Capillary Column Gas Chromatography of Phthalate Esters, J. Chromatogr., 1979, 172, 1, 261-271, https://doi.org/10.1016/S0021-9673(00)90961-0 . [all data]