Hex-5-enoic acid, ethyl ester

Normal alkane RI, polar column, temperature ramp

Data compiled by: NIST Mass Spectrometry Data Center, William E. Wallace, director

Column type CapillaryCapillaryCapillaryCapillaryCapillary
Active phase DB-WaxCarbowax 20MCarbowax 20MCarbowax 20MCarbowax 20M
Column length (m) 60.50.50.50.50.
Carrier gas HeN2N2N2N2
Substrate
Column diameter (mm) 0.320.220.220.220.22
Phase thickness (μm) 0.25
Tstart (C) 30.80.80.80.80.
Tend (C) 180.200.200.200.200.
Heat rate (K/min) 2.3.3.3.3.
Initial hold (min) 4.
Final hold (min) 25.
I 1272.1269.1271.1269.1271.
ReferenceTakeoka, Buttery, et al., 1991Mihara, Tateba, et al., 1988Mihara, Tateba, et al., 1988Mihara, Tateba, et al., 1987Mihara, Tateba, et al., 1987
Comment MSDC-RI MSDC-RI MSDC-RI MSDC-RI MSDC-RI

References

Takeoka, Buttery, et al., 1991
Takeoka, G.R.; Buttery, R.G.; Teranishi, R.; Flath, R.A.; Güntert, M., Identification of additional pineapple volatiles, J. Agric. Food Chem., 1991, 39, 10, 1848-1851, https://doi.org/10.1021/jf00010a032 . [all data]

Mihara, Tateba, et al., 1988
Mihara, S.; Tateba, H.; Nishimura, O.; Machii, Y.; Kishino, K., The volatile components of Chinese quince (Pseudocydonia sinensis Schneid) in Flavors and Fragrances: A World Perspective. Proceedings of the 10th International Congress of Essential Oils, Fragrances and Flavors, Lawrence,B.M.; Mookherjee,B.D.; Willis,B.J., ed(s)., Elsevier, New York, 1988, 537-550. [all data]

Mihara, Tateba, et al., 1987
Mihara, S.; Tateba, H.; Nishimura, O.; Machii, Y.; Kishino, K., Volatile components of Chinese quince (Pseudocydonia sinensis Schneid), J. Agric. Food Chem., 1987, 35, 4, 532-537, https://doi.org/10.1021/jf00076a023 . [all data]