(2R,4R)-p-Mentha-[1(7),8]-diene, 2-hydroperoxide

Normal alkane RI, non-polar column, custom temperature program

View large format table.

Column type Active phase I Reference Comment
CapillarySE-541338.Schieberle, Maier, et al., 1987He; Column length: 30. m; Column diameter: 0.32 mm; Program: 35 0C (2 min) 60 0C/min -> 50 0C (5 min) 4 0C/min -> 220 0C

References

Schieberle, Maier, et al., 1987
Schieberle, P.; Maier, W.; Firl, J.; Grosch, W., HRGC separation of hydroperoxides formed during the photosensitized oxidation of (R)-(+)-limonene, J. Hi. Res. Chromatogr. Chromatogr. Comm., 1987, 10, 11, 588-593, https://doi.org/10.1002/jhrc.1240101102 . [all data]