5-Ethyl-5-(4-acetoxyphenyl)-hexahydropyrimidin-2,4,6-trione

Kovats' RI, non-polar column, temperature ramp

View large format table.

Column type Active phase I Reference Comment
PackedSE-302360.Maurer, 1990N2, 100. C @ 3. min, 30. K/min, 310. C @ 5. min
PackedSE-302360.Maurer, 1990N2, 100. C @ 3. min, 30. K/min, 310. C @ 5. min
PackedOV-1012360.Maurer, 1990, 2N2, Chromosorb G HP, 100. C @ 3. min, 30. K/min, 310. C @ 5. min; Column length: 0.6 m
PackedOV-1012360.Maurer, 1990, 2N2, Chromosorb G HP, 100. C @ 3. min, 30. K/min, 310. C @ 5. min; Column length: 0.6 m
PackedOV-1012360.Maurer, 1990, 2N2, Chromosorb G HP, 100. C @ 3. min, 30. K/min, 310. C @ 5. min; Column length: 0.6 m

References

Maurer, 1990
Maurer, H.H., Identification and differentiation of barbiturates, other sedative-hypnotics and their metabolites in urine integrated in a general screening procedure using computerized gas chromatography-mass spectrometry, J. Chromatogr., 1990, 530, 307-326, https://doi.org/10.1016/S0378-4347(00)82334-8 . [all data]

Maurer, 1990, 2
Maurer, H.H., Detection of anticonvulsants and their metabolites in urine within a general unknown analysis procedure using computerized gas chromatography-mass spectrometry, Arch. Toxicol., 1990, 64, 7, 554-561, https://doi.org/10.1007/BF01971834 . [all data]