2-Acetyl-2,3,5,6-tetrahydro-1,4-thiazine

Normal alkane RI, non-polar column, temperature ramp

View large format table.

Column type Active phase I Reference Comment
CapillarySPB-11225.Huang, Su, et al., 199860. m/0.32 mm/0.25 μm, He, 4. K/min; Tstart: 80. C; Tend: 200. C

References

Huang, Su, et al., 1998
Huang, T.-C.; Su, Y.-M.; Ho, C.-T., Mechanistic studies on the formation of thiazolidine and structurally related thiazines in a cysteamine/2,3-butanedione model system, J. Agric. Food Chem., 1998, 46, 2, 664-667, https://doi.org/10.1021/jf970602a . [all data]