E-11-Hexadecenoic acid, ethyl ester

Normal alkane RI, non-polar column, custom temperature program

View large format table.

Column type Active phase I Reference Comment
CapillaryHP-51974.Demyttenaere, Sánchez Martínez, et al., 200330. m/0.25 mm/0.25 μm, He; Program: 35C => 5C/min => 220C => 10C/min => 240C(5min)
CapillaryHP-5MS1974.Demyttenaere, Sánchez Martínez, et al., 200230. m/0.25 mm/0.25 μm, He; Program: 35C => 5C/min => 160C => 10C/min => 220C (10min)

Normal alkane RI, polar column, custom temperature program

View large format table.

Column type Active phase I Reference Comment
CapillaryBP-202236.Pontes, Marques, et al., 200730. m/0.25 mm/0.25 μm, He; Program: 50C(1min) => 2.5C/min => 100C => 2C/min => 180C => 15C/min => 220C

References

Demyttenaere, Sánchez Martínez, et al., 2003
Demyttenaere, J.C.R.; Sánchez Martínez, J.I.; Verhé, R.; Sandra, P.; de Kimpe, N., Analysis of volatiles of malt whisky by solid-phase microextraction and stir bar sorptive extraction, J. Chromatogr. A, 2003, 985, 1-2, 221-232, https://doi.org/10.1016/S0021-9673(02)01471-1 . [all data]

Demyttenaere, Sánchez Martínez, et al., 2002
Demyttenaere, J.C.R.; Sánchez Martínez, J.I.; Téllez Valdés, M.J.; Verhé, R.; Sandra, P., Analysis of volatile esters of malt whisky using solid phase microextraction and dynamic headspace in 25th International Symposium on Capillary Chromatography, 2002, 1-13. [all data]

Pontes, Marques, et al., 2007
Pontes, M.; Marques, J.C.; Camara, J.S., Screening of volatile composition from Portuguese multifloral honeys using headspace solid-phase microextraction-gas chromatography-quadrupole mass spectrometry, Talanta, 2007, 74, 1, 91-103, https://doi.org/10.1016/j.talanta.2007.05.037 . [all data]