Pentanedioic acid, 2-[(tert-butyldimethylsilyl)oxy]-, bis(tert-butyldimethylsilyl) ester

Van Den Dool and Kratz RI, non-polar column, temperature ramp

Data compiled by: NIST Mass Spectrometry Data Center, William E. Wallace, director

Column type CapillaryCapillary
Active phase DB-5DB-5
Column length (m) 30.30.
Carrier gas
Substrate
Column diameter (mm) 0.250.25
Phase thickness (μm) 0.250.25
Tstart (C) 100.100.
Tend (C) 300.300.
Heat rate (K/min) 10.10.
Initial hold (min) 1.1.
Final hold (min) 15.15.
I 2219.2219.
ReferenceOhie, Fu, et al., 2000Ohie, Fu, et al., 2000
Comment MSDC-RI MSDC-RI

References

Ohie, Fu, et al., 2000
Ohie, T.; Fu, X.; Iga, M.; Kimura, M.; Yamaguchi, S., Gas chromatography-mass spectrometry with tert .-butyldimethylsilyl derivatization: use of the simplified sample preparations and the automated data system to screen for organic acidemias, J. Chromatogr. B, 2000, 746, 1, 63-73, https://doi.org/10.1016/S0378-4347(00)00105-5 . [all data]