Sclareoloxide

Normal alkane RI, non-polar column, custom temperature program

View large format table.

Column type Active phase I Reference Comment
CapillaryHP-5MS1906.Güllüce, Özer, et al., 200630. m/0.25 mm/0.25 μm, He; Program: 50C(3min) => 3C/min => 150C(10min) => 10C/min => 250C
CapillaryCP Sil 5 CB1876.Weyerstahl, Marschall, et al., 1998He; Column length: 25. m; Phase thickness: 0.39 μm; Program: not specified

Normal alkane RI, polar column, temperature ramp

View large format table.

Column type Active phase I Reference Comment
CapillaryDB-Wax2223.Cai, Lin, et al., 200660. m/0.25 mm/0.5 μm, He, 50. C @ 2. min, 3. K/min, 230. C @ 20. min

Normal alkane RI, polar column, custom temperature program

View large format table.

Column type Active phase I Reference Comment
CapillaryDB-Wax2247.Weyerstahl, Marschall, et al., 1998N2; Column length: 60. m; Phase thickness: 0.25 μm; Program: not specified

References

Güllüce, Özer, et al., 2006
Güllüce, M.; Özer, H.; Baris, Ö.; Daferera, D.; Sahin, F.; Polissiou, M., Chemical Composition of the Essential Oil of Salvia aethiopis L., Turkish Journal of Biology, 2006, 30, 231-233. [all data]

Weyerstahl, Marschall, et al., 1998
Weyerstahl, P.; Marschall, H.; Weirauch, M.; Thefeld, K.; Surburg, H., Constituents of commercial Labdanum oil, Flavour Fragr. J., 1998, 13, 5, 295-318, https://doi.org/10.1002/(SICI)1099-1026(1998090)13:5<295::AID-FFJ751>3.0.CO;2-I . [all data]

Cai, Lin, et al., 2006
Cai, J.; Lin, P.; Zhu, X.; Su, Q., Comparative analysis of clary sage (S. sclarea L.) oil volatiles by GC-FTIR and GC-MS, Food Chem., 2006, 99, 2, 401-407, https://doi.org/10.1016/j.foodchem.2005.07.041 . [all data]