Bicyclo[3.1.1]hept-2-en-4-ol, 2,6,6-trimethyl-, acetate

Van Den Dool and Kratz RI, non-polar column, temperature ramp

Data compiled by: NIST Mass Spectrometry Data Center, William E. Wallace, director

Column type CapillaryCapillaryCapillaryCapillary
Active phase HP-5SPB-5RTX-5DB-5
Column length (m) 30.30.30.30.
Carrier gas N2HeHe
Substrate
Column diameter (mm) 0.250.250.250.25
Phase thickness (μm) 0.250.250.250.25
Tstart (C) 60.60.45.50.
Tend (C) 220.250.250.250.
Heat rate (K/min) 5.4.3.3.
Initial hold (min) 10.2.6.
Final hold (min)  20.
I 1292.1293.1297.1294.
ReferenceFlamini, Luigi Cioni, et al., 2005Pino, Marbot, et al., 2003Shellie, Marriott, et al., 2003Isidorov, Zenkevich, et al., 1998
Comment MSDC-RI MSDC-RI MSDC-RI MSDC-RI

References

Flamini, Luigi Cioni, et al., 2005
Flamini, G.; Luigi Cioni, P.; Morelli, I., Composition of the essential oils and in vivo emission of volatiles of four Lamium species from Italy: L. purpureum, L. hybridum, L. bifidum and L. amplexicaule, Food Chem., 2005, 91, 1, 63-68, https://doi.org/10.1016/j.foodchem.2004.05.047 . [all data]

Pino, Marbot, et al., 2003
Pino, J.; Marbot, R.; Rosado, A.; Vázquez, C., Volatile constituents of fruits of Garcinia dulcis Kurz. from Cuba, Flavour Fragr. J., 2003, 18, 4, 271-274, https://doi.org/10.1002/ffj.1187 . [all data]

Shellie, Marriott, et al., 2003
Shellie, R.; Marriott, P.; Zappia, G.; Mondello, L.; Dugo, G., Interactive use of linear retention indices on polar and apolar columns with an MS-Library for reliable characterization of Australian tea tree and other Melaleuca sp. oils, J. Essent. Oil Res., 2003, 15, 5, 305-312, https://doi.org/10.1080/10412905.2003.9698597 . [all data]

Isidorov, Zenkevich, et al., 1998
Isidorov, V.A.; Zenkevich, I.G.; Dubis, E.N.; Slowikowski, A.; Wojciuk, E., Group identification of essential oils components using partition coefficients in a hexane-acetonitrile system, J. Chromatogr. A, 1998, 814, 1-2, 253-260, https://doi.org/10.1016/S0021-9673(98)00398-7 . [all data]