4-(2,7,7-Trimethylbicyclo[3.2.0]hept-2-en-1-yl)but-3-en-2-one

Normal alkane RI, non-polar column, temperature ramp

View large format table.

Column type Active phase I Reference Comment
CapillaryHP-5 MS1472.Xu, Han, et al., 200930. m/0.25 mm/0.25 μm, Helium, 60. C @ 2. min, 15. K/min, 300. C @ 10. min
CapillaryUltra-21394.Khalilov L.M., Khalilova A.Z., et al., 199932. C @ 5. min, 4. K/min; Column length: 50. m; Column diameter: 0.32 mm; Tend: 250. C

References

Xu, Han, et al., 2009
Xu, L.-L.; Han, T.; Wu, J.-Z.; Zhang, Q.-Y.; Zhang, H.; Huang, B.-K.; Rahman, K., Comparative research of chemical constituents, antifungal and antitumor properties of ether extracts of Panax ginseng and its endophytic fungus, Phytomedicine: Int. J. Phytotherapy Phytopharmacology, 2009, 16, 6-7, 609-616, https://doi.org/10.1016/j.phymed.2009.03.014 . [all data]

Khalilov L.M., Khalilova A.Z., et al., 1999
Khalilov L.M.; Khalilova A.Z.; Odinokov V.N.; Baltaev U.A.; Paramonov E.A.; Dzhemilev U.M., Identification and biological activity of the volatile organic substances emitted by plants and insects - II. Sesquiterpene composition of the native scent of leaves of the potato Solanum tuberosum, Chem. Nat. Compd. (Engl. Transl.), 1999, 35, 4, 422-426, https://doi.org/10.1007/BF02282508 . [all data]