12-Methyl-oxa-cyclododecan-2-one

Normal alkane RI, non-polar column, custom temperature program

View large format table.

Column type Active phase I Reference Comment
CapillaryCP Sil 5 CB1445.Weyerstahl, Marschall, et al., 1997N2; Column length: 30. m; Column diameter: 0.25 mm; Program: not specified

References

Weyerstahl, Marschall, et al., 1997
Weyerstahl, P.; Marschall, H.; Seelmann, I.; Rustaiyan, A., Constituents of the essential oil of Achillea eriophora DC, Flavour Fragr. J., 1997, 12, 2, 71-78, https://doi.org/10.1002/(SICI)1099-1026(199703)12:2<71::AID-FFJ620>3.0.CO;2-E . [all data]