Octa-2,4,6-triene

Van Den Dool and Kratz RI, non-polar column, temperature ramp

View large format table.

Column type Active phase I Reference Comment
CapillaryCP Sil 5 CB925.Montanarella, Bos, et al., 1986N2, 4. K/min; Column length: 25. m; Column diameter: 0.22 mm; Tstart: 70. C; Tend: 295. C

References

Montanarella, Bos, et al., 1986
Montanarella, L.; Bos, R.; Fischer, F.C., The Essential Oil in Lamina and Petiole of Heracleum dissectum Leaves, Planta Medica, 1986, 52, 04, 332-334, https://doi.org/10.1055/s-2007-969171 . [all data]