5-Isopropenyl-2-methylcyclopent-1-enecarboxaldehyde

Kovats' RI, polar column, temperature ramp

View large format table.

Column type Active phase I Reference Comment
CapillaryDB-Wax1691.Yukawa, Iwabuchi, et al., 2005He, 50. C @ 2. min, 3. K/min; Column length: 60. m; Column diameter: 0.25 mm; Tend: 220. C

Van Den Dool and Kratz RI, non-polar column, custom temperature program

View large format table.

Column type Active phase I Reference Comment
CapillaryBPX-51271.Cardeal, da Silva, et al., 200630. m/0.25 mm/0.25 μm; Program: 35C(5min) => 3C/min => 210C => 40C/min => 240C (4min)

References

Yukawa, Iwabuchi, et al., 2005
Yukawa, C.; Iwabuchi, H.; Komemushi, S.; Sawabe, A., Mono- and sesquiterpenoids of the volatile oil of Bursera graveolens, Flavour Fragr. J., 2005, 20, 6, 653-658, https://doi.org/10.1002/ffj.1523 . [all data]

Cardeal, da Silva, et al., 2006
Cardeal, Z.L.; da Silva, M.D.R.G.; Marriott, P.J., Comprehensive two-dimensional gas chromatography/mass spectrometric analysis of pepper volatiles, Rapid Commun. Mass Spectrom., 2006, 20, 19, 2823-2836, https://doi.org/10.1002/rcm.2665 . [all data]