Ledene oxide-(II)

Normal alkane RI, non-polar column, temperature ramp

Data compiled by: NIST Mass Spectrometry Data Center, William E. Wallace, director

Column type CapillaryCapillaryCapillary
Active phase DB-1DB-1DB-1
Column length (m) 60.30.30.
Carrier gas N2HeHe
Substrate
Column diameter (mm) 0.250.250.25
Phase thickness (μm) 0.250.250.25
Tstart (C) 60.50.50.
Tend (C) 250.265.265.
Heat rate (K/min) 5.2.52.5
Initial hold (min)  1.1.
Final hold (min) 10.20.20.
I 1682.1646.1646.
ReferenceFakhari A.R., Sonboli A., et al., 2005Sarkhail, Amin, et al., 2005Sarkhail, Amin, et al., 2004
Comment MSDC-RI MSDC-RI MSDC-RI

References

Fakhari A.R., Sonboli A., et al., 2005
Fakhari A.R.; Sonboli A.; Heydari R., Composition of the essential oil of Rhabdosciadium strausii from Iran, Chem. Nat. Compd. (Engl. Transl.), 2005, 41, 4, 413-414, https://doi.org/10.1007/s10600-005-0164-1 . [all data]

Sarkhail, Amin, et al., 2005
Sarkhail, P.; Amin, G.; Surmaghi, M.H.S.; Shafiee, A., Composition of the volatile oils of Phlomis lanceolata Boiss. Hohen., Phlomis anisodonta Boiss. and Phlomis bruguieri Desf. from Iran, Flavour Fragr. J., 2005, 20, 3, 327-329, https://doi.org/10.1002/ffj.1427 . [all data]

Sarkhail, Amin, et al., 2004
Sarkhail, P.; Amin, G.; Shafiee, A., Composition of the essential oil of Phlomis persica Boiss and Phlomis chorassanica Bunge from Iran, Flavour Fragr. J., 2004, 19, 6, 538-540, https://doi.org/10.1002/ffj.1338 . [all data]