γ-Neoclovene

Normal alkane RI, polar column, temperature ramp

Data compiled by: NIST Mass Spectrometry Data Center, William E. Wallace, director

Column type Capillary
Active phase RTX-Wax
Column length (m) 60.
Carrier gas He
Substrate
Column diameter (mm) 0.25
Phase thickness (μm) 0.5
Tstart (C) 40.
Tend (C) 180.
Heat rate (K/min) 5.
Initial hold (min) 5.
Final hold (min) 20.
I 1754.
ReferenceGalindo-Cuspinera, Lubran, et al., 2002
Comment MSDC-RI

References

Galindo-Cuspinera, Lubran, et al., 2002
Galindo-Cuspinera, V.; Lubran, M.B.; Rankin, S.A., Comparison of volatile compounds in water- and oil-soluble annatto (Bixa orellana L.) extracts, J. Agric. Food Chem., 2002, 50, 7, 2010-2015, https://doi.org/10.1021/jf011325h . [all data]