Tricyclo[6.3.0.0(2,4)]undec-8-ene, 3,3,7,11-tetramethyl-

Normal alkane RI, polar column, custom temperature program

Data compiled by: NIST Mass Spectrometry Data Center, William E. Wallace, director

Column type Capillary
Active phase DB-Wax
Column length (m) 60.
Carrier gas N2
Substrate
Column diameter (mm)
Phase thickness (μm) 0.25
Program not specified
I 1619.
ReferenceWeyerstahl, Marschall, et al., 1998
Comment MSDC-RI

References

Weyerstahl, Marschall, et al., 1998
Weyerstahl, P.; Marschall, H.; Weirauch, M.; Thefeld, K.; Surburg, H., Constituents of commercial Labdanum oil, Flavour Fragr. J., 1998, 13, 5, 295-318, https://doi.org/10.1002/(SICI)1099-1026(1998090)13:5<295::AID-FFJ751>3.0.CO;2-I . [all data]