Ledene oxide-(I)

Van Den Dool and Kratz RI, non-polar column, temperature ramp

View large format table.

Column type Active phase I Reference Comment
CapillaryHP-5MS1890.Lalel, Singh, et al., 200360. m/0.25 mm/0.25 μm, He, 40. C @ 1. min, 3. K/min, 310. C @ 20. min

Normal alkane RI, polar column, custom temperature program

View large format table.

Column type Active phase I Reference Comment
CapillaryHP-Innowax1812.Sun, Hua, et al., 201030. m/0.32 mm/0.50 μm, Helium; Program: 50 0C (5 min) 3 0C/min -> 210 0C (10 min) 3 0C/min -> 230 0C

References

Lalel, Singh, et al., 2003
Lalel, H.J.D.; Singh, Z.; Chye Tan, S., Glycosidically-bound aroma volatile compounds in the skin and pulp of 'Kensington Pride' mango fruit at different stages of maturity, Postharvest Biol. Technol., 2003, 29, 2, 205-218, https://doi.org/10.1016/S0925-5214(02)00250-8 . [all data]

Sun, Hua, et al., 2010
Sun, Q.-L.; Hua, S.; Ye, J.-H.; Zheng, X.-Q.; Liang, Y.-R., Flavonoids and volatiles in Chrysanthemum morifolium Ramat flower from Tongxiang County in China, Afr. J. Biotechnol., 2010, 9, 25, 3817-3821. [all data]