2,2,4a,6a,6b,9-Hexamethyl-1,2,3,4,4 a,5,6,6a,6b,7,8,12b,13,14b-tetradecahydro-picene

Kovats' RI, non-polar column, isothermal

View large format table.

Column type Active phase Temperature (C) I Reference Comment
CapillaryPetrocol DH250.3013.08Collins, Rohar, et al., 1995100. m/0.25 mm/0.5 μm, He

References

Collins, Rohar, et al., 1995
Collins, L.W.; Rohar, P.C.; Veloski, G.A.; Mahlberg, P.G.; Haubold, H.; White, C.M., Identification of polycyclic hydrocarbons in fossilized latex from brown coal, Polycyclic Aromat. Compd., 1995, 7, 4, 223-230, https://doi.org/10.1080/10406639508009626 . [all data]