2-Butanone,3-oxo-,(2,4-dinitrophenyl)hydrazone

Kovats' RI, non-polar column, isothermal

View large format table.

Column type Active phase Temperature (C) I Reference Comment
PackedOV-3205.2411.Pías and Gascó, 1975Mixture; Column length: 1. m

References

Pías and Gascó, 1975
Pías, J.B.; Gascó, L., Gas-liquid chromatography of 2,4-dinitrophenylhydrazones of carbonyl compounds; retention indices and molecular structure, Chromatographia, 1975, 8, 6, 270-273, https://doi.org/10.1007/BF02270935 . [all data]