3-Quinuclidinol, trimethylsilyl ether

Van Den Dool and Kratz RI, non-polar column, temperature ramp

View large format table.

Column type Active phase I Reference Comment
CapillarySE-541268.Kostiainen, 200025. m/0.32 mm/0.25 μm, He, 40. C @ 1. min, 10. K/min, 280. C @ 10. min

Normal alkane RI, non-polar column, temperature ramp

View large format table.

Column type Active phase I Reference Comment
CapillarySE-541265.Budiman, 200730. m/0.25 mm/0.25 μm, Helium, 40. C @ 1. min, 10. K/min, 280. C @ 5. min

Normal alkane RI, non-polar column, custom temperature program

View large format table.

Column type Active phase I Reference Comment
CapillarySE-541268.Budiman, 200730. m/0.25 mm/0.25 μm, Helium; Program: not specified
Capillary5 % Phenyl methyl siloxane1268.OPCW, 1997Program: not specified

References

Kostiainen, 2000
Kostiainen, O., Gas Chromatography in Screening of Chemicals Related to the Chemical Weapons Convention in Encyclopedia of Analytical Chemistry, Meyers, R.A., ed(s)., John Wiley Sons Ltd, Chichester, 2000, 963-979. [all data]

Budiman, 2007
Budiman, H., Analysis and identification spiking chemical compounds related to chemical weapon convention in unknown water samples using gas chromatography and gas chromatography electron ionization mass spectrometry, Indo. J. Chem., 2007, 7, 3, 297-302. [all data]

OPCW, 1997
OPCW, Conference of the States Parties C-I/DEC.64 (22 May 1997), 1997, retrieved from http://www.opcw.org/html/global/cseries/csp1/CIDEC64.html. [all data]