3-Hydroxyglutaric acid, tri-TMS

Kovats' RI, non-polar column, isothermal

View large format table.

Column type Active phase Temperature (C) I Reference Comment
PackedOV-1160.1583.Petersson, 1977N2, Chromosorb G (100-120 mesh); Column length: 2. m

Van Den Dool and Kratz RI, non-polar column, temperature ramp

View large format table.

Column type Active phase I Reference Comment
CapillaryDB-51582.Kimura, Yamamoto, et al., 199930. m/0.25 mm/1. μm, He, 100. C @ 4. min, 4. K/min, 290. C @ 10. min
CapillaryOV-11596.Lefevere, Verhaeghe, et al., 198910. m/0.22 mm/0.17 μm, He, 5. K/min; Tstart: 70. C; Tend: 270. C
CapillarySE-521590.Lefevere, Verhaeghe, et al., 198925. m/0.32 mm/0.52 μm, He, 5. K/min; Tstart: 70. C; Tend: 270. C
CapillaryUltra-21590.Tuchman, Bowers, et al., 198425. m/0.31 mm/0.52 μm, He, 5. K/min; Tstart: 50. C; Tend: 300. C

References

Petersson, 1977
Petersson, G., Retention Data in GLC Analysis; Carbohydrate-Related Hydroxy Carboxylic and Dicarboxylic Acids as Trimethylsilyl Derivatives, J. Chromatogr. Sci., 1977, 15, 7, 245-255, https://doi.org/10.1093/chromsci/15.7.245 . [all data]

Kimura, Yamamoto, et al., 1999
Kimura, M.; Yamamoto, T.; Yamaguchi, S., Automated metabolic profiling and interpretation of GC/MS data for organic acidemia screening: a personal computer-based system, Tohoku J. Exp. Med., 1999, 188, 4, 317-334, https://doi.org/10.1620/tjem.188.317 . [all data]

Lefevere, Verhaeghe, et al., 1989
Lefevere, M.F.; Verhaeghe, B.J.; Declerck, D.H.; Van Bocxlaer, J.F.; De Leenheer, A.P.; De Sagher, R.M., Metabolic Profiling of Urinary Organic Acids by Single and Multicolumn Capillary Gas Chromatography, J. Chromatogr. Sci., 1989, 27, 1, 23-29, https://doi.org/10.1093/chromsci/27.1.23 . [all data]

Tuchman, Bowers, et al., 1984
Tuchman, M.; Bowers, L.D.; Fregien, K.D.; Crippin, P.J.; Krivit, W., Capillary Gas Chromatographic Separation of Urinary Organic Acids. Retention Indices of 101 Urinary Acids on a 5% Phenylmethyl Silicone Capillary Column, J. Chromatogr. Sci., 1984, 22, 5, 198-202, https://doi.org/10.1093/chromsci/22.5.198 . [all data]